Error: Exporting to Android

1 favourites

    I believe the admins don't work on weekends - it's a small company, and everyone needs a break from work to switch off and get on with their lives and do their hobbies, see friends and family.

    If they peeked at the forum every single day for the past 10 years, then that'd drive anyone insane.

    Rest assured, it will be looked at and maybe even fixed on Monday.

    I Hope

    I have the same problem too!

    I believe the admins don't work on weekends - it's a small company, and everyone needs a break from work to switch off and get on with their lives and do their hobbies, see friends and family.

    If they peeked at the forum every single day for the past 10 years, then that'd drive anyone insane.

    Rest assured, it will be looked at and maybe even fixed on Monday.

    Wise words. I will hope for the best.

    Error: Checking Java JDK and Android SDK versions

    ANDROID_SDK_ROOT=~~/androidSDK (recommended setting)

    ANDROID_HOME=~~/androidSDK (DEPRECATED)

    Using Android SDK: ~~/androidSDK

    :wrapper

    BUILD SUCCESSFUL in 1s

    1 actionable task: 1 executed

    Subproject Path: CordovaLib

    Subproject Path: app

    FAILURE: Build failed with an exception.

    * What went wrong:

    Could not initialize class java.nio.file.FileSystems$DefaultFileSystemHolder

    * Try:

    Run with --stacktrace option to get the stack trace. Run with --info or --debug option to get more log output. Run with --scan to get full insights.

    * Get more help at https:/~~/help.gradle.org

    BUILD FAILED in 999ms

    Command failed with exit code 1: ~~/gradlew cdvBuildDebug -b ~~/build.gradle

    I could export dev APK an hour ago. Still dont know where this error came from

    I HAVE THE SAME APK BUILD ERROR !

    Same here...

    Same Here

    Same :(

    Error: Checking Java JDK and Android SDK versions

    ANDROID_SDK_ROOT=~~/androidSDK (recommended setting)

    ANDROID_HOME=~~/androidSDK (DEPRECATED)

    Using Android SDK: ~~/androidSDK

    :wrapper

    BUILD SUCCESSFUL in 0s

    1 actionable task: 1 executed

    Subproject Path: CordovaLib

    Subproject Path: app

    FAILURE: Build failed with an exception.

    * What went wrong:

    Could not initialize class java.nio.file.FileSystems$DefaultFileSystemHolder

    * Try:

    Run with --stacktrace option to get the stack trace. Run with --info or --debug option to get more log output. Run with --scan to get full insights.

    * Get more help at https:/~~/help.gradle.org

    BUILD FAILED in 590ms

    Command failed with exit code 1: ~~/gradlew cdvBuildDebug -b ~~/build.gradle

    I'm going to take this as a sign from the Android Gods that I should double and triple check my code before I finally publish.

    Deadlines are for nerds anyway.

    Same situation

    Error: Checking Java JDK and Android SDK versions

    ANDROID_SDK_ROOT=~~/androidSDK (recommended setting)

    ANDROID_HOME=~~/androidSDK (DEPRECATED)

    Using Android SDK: ~~/androidSDK

    :wrapper

    BUILD SUCCESSFUL in 1s

    1 actionable task: 1 executed

    Subproject Path: CordovaLib

    Subproject Path: app

    FAILURE: Build failed with an exception.

    * What went wrong:

    Could not initialize class java.nio.file.FileSystems$DefaultFileSystemHolder

    * Try:

    Run with --stacktrace option to get the stack trace. Run with --info or --debug option to get more log output. Run with --scan to get full insights.

    * Get more help at https:/~~/help.gradle.org

    BUILD FAILED in 1s

    Command failed with exit code 1: ~~/gradlew cdvBuildRelease -b ~~/build.gradle

    We are aware of current issues with our build server and are working on a fix.

    We apologise for the inconvenience and thank you for your patience.

    Thank you for all your feedback !

    The issue should be fixed now.

    Could you guys try and provide us feedback whether you are still having issues building to Android or not, please ?

  • Try Construct 3

    Develop games in your browser. Powerful, performant & highly capable.

    Try Now Construct 3 users don't see these ads

    The issue

    alert('Hello world!');

    should be fixed now.

    Could you guys try and provide us feedback whether you are still having issues building to Android or not, please ?

    It works now thank you so much

    I have built my project.

    Thank you!

    It works now, tnx for fast response...

Jump to:
Order by:
Duplicate Topics
Posts
Views
Last Post
Active Users
There are 1 visitors browsing this topic (0 users and 1 guests)