debuging problem

  • hello im trying to make signed app for android but i have some error code can someone look and explain to me what need to be chenged

    Error: Checking Java JDK and Android SDK versions

    ANDROID_SDK_ROOT=~~/androidSDK (recommended setting)

    ANDROID_HOME=~~/androidSDK (DEPRECATED)

    :wrapper

    BUILD SUCCESSFUL in 1s

    1 actionable task: 1 executed

    Subproject Path: CordovaLib

    Subproject Path: app

    Configure project :app

    Project evaluation failed including an error in afterEvaluate {}. Run with --stacktrace for details of the afterEvaluate {} error.

    FAILURE: Build failed with an exception.

    * Where:

    Script '~~/cordova.gradle' line: 132

    * What went wrong:

    A problem occurred evaluating project ':app'.

    No match found

    * Try:

    Run with --stacktrace option to get the stack trace. Run with --info or --debug option to get more log output. Run with --scan to get full insights.

    * Get more help at https:/~~/help.gradle.org

    BUILD FAILED in 1s

    ~~/gradlew: Command failed with exit code 1 Error output:

    Project evaluation failed including an error in afterEvaluate {}. Run with --stacktrace for details of the afterEvaluate {} error.

    FAILURE: Build failed with an exception.

    * Where:

    Script '~~/cordova.gradle' line: 132

    * What went wrong:

    A problem occurred evaluating project ':app'.

    No match found

    * Try:

    Run with --stacktrace option to get the stack trace. Run with --info or --debug option to get more log output. Run with --scan to get full insights.

    * Get more help at https:/~~/help.gradle.org

    BUILD FAILED in 1s

  • Try Construct 3

    Develop games in your browser. Powerful, performant & highly capable.

    Try Now Construct 3 users don't see these ads
Jump to:
Active Users
There are 1 visitors browsing this topic (0 users and 1 guests)