Appodeal In

0 favourites
  • 2 posts
  • Im having a problem during the compilation in cocoon

    So i have CocoonGooglePlayGames plugin on my game and then i also implemented Appodeal plugin for my ads, i install this beause it needed to install but during the compilation i got this error:


    FAILURE: Build failed with an exception.

    * What went wrong: Execution failed for task ':transformClassesWithDexForArmv7Debug'. > org.gradle.process.internal.ExecException: Process 'command '/Library/Java/JavaVirtualMachines/jdk1.8.0_112.jdk/Contents/Home/bin/java'' finished with non-zero exit value 2 * Try: Run with --stacktrace option to get the stack trace. Run with --info or --debug option to get more log output. FAILED



    I tried to remove the CocoonGooglePlayGames plugin and viola, My compilation was successfull the ads are workinb but i really wanted to put a leaderboard on my bame and i needed that CocoonGooglePlayGames plugin to do that

  • Try Construct 3

    Develop games in your browser. Powerful, performant & highly capable.

    Try Now Construct 3 users don't see these ads
  • Temporary solved. Im now able to compile it using this custom plugin but a never ending black screen appeared on my game

Jump to:
Active Users
There are 1 visitors browsing this topic (0 users and 1 guests)